Target
Muscarinic acetylcholine receptor M3
Ligand
BDBM50240552
Substrate
Meas. Tech.
ChEMBL_1871945 (CHEMBL4373112)
Ki
0.530000±n/a nM
Citation
 Lee, NRGujarathi, SBommagani, SSiripurapu, KZheng, GDwoskin, LP Muscarinic agonist, (±)-quinuclidin-3-yl-(4-fluorophenethyl)(phenyl)carbamate: High affinity, but low subtype selectivity for human M Bioorg Med Chem Lett 29:471-476 (2019)  
Target
Name:
Muscarinic acetylcholine receptor M3
Synonyms:
ACM3_HUMAN Cholinergic, muscarinic M3 Muscarinic receptor M3 | RecName: Full=Muscarinic acetylcholine receptor M3
Type:
Enzyme
Mol. Mass.:
66151.03
Organism:
Homo sapiens (Human)
Description:
P20309
Residue:
590
  
Inhibitor
Name:
BDBM50240552
Synonyms:
CHEMBL195
Type:
Small organic molecule
Emp. Form.:
C17H23NO3
Mol. Mass.:
289.3694
SMILES:
[H][C@@]12CC[C@]([H])(CC(C1)OC(=O)C(CO)c1ccccc1)N2C
: