Target
Cysteinyl leukotriene receptor 1
Ligand
BDBM50070921
Substrate
Meas. Tech.
ChEBML_52385
Ki
14±n/a nM
Citation
 Chambers, RJAntognoli, GWCheng, JBKuperman, AVListon, TCMarfat, AOwens, BSPillar, JSShirley, JTWatson, JW Development of 2,2-dimethylchromanol cysteinyl LT1 receptor antagonists. Bioorg Med Chem Lett 8:3577-82 (1999)  
Target
Name:
Cysteinyl leukotriene receptor 1
Synonyms:
CLTR1_CAVPO | CYSLTR1
Type:
Enzyme Catalytic Domain
Mol. Mass.:
39007.58
Organism:
GUINEA PIG
Description:
Leukotriene D4 0 GUINEA PIG::Q2NNR5
Residue:
340
  
Inhibitor
Name:
BDBM50070921
Synonyms:
3-[(3R,4R)-6-(5-Fluoro-benzothiazol-2-ylmethoxy)-4-hydroxy-chroman-3-ylmethyl]-benzoic acid CHEMBL442150
Type:
Small organic molecule
Emp. Form.:
C25H20FNO5S
Mol. Mass.:
465.493
SMILES:
O[C@@H]1[C@H](Cc2cccc(c2)C(O)=O)COc2ccc(OCc3nc4cc(F)ccc4s3)cc12
: