Target
Prothrombin
Ligand
BDBM50073316
Substrate
Meas. Tech.
ChEMBL_208548 (CHEMBL814317)
Ki
15±n/a nM
Citation
 Adang, AELucas, Hde Man, APEngh, RAGrootenhuis, PD Novel acylguanidine containing thrombin inhibitors with reduced basicity at the P1 moiety. Bioorg Med Chem Lett 8:3603-8 (1999)  
Target
Name:
Prothrombin
Synonyms:
Activation peptide fragment 1 Coagulation factor II Prothrombin precursor Thrombin heavy chain | Thrombin light chain
Type:
Protein
Mol. Mass.:
70029.57
Organism:
Homo sapiens (Human)
Description:
P00734
Residue:
622
  
Inhibitor
Name:
BDBM50073316
Synonyms:
CHEMBL114715 {(R)-1-Cyclohexylmethyl-2-[(S)-2-(3-guanidino-propylcarbamoyl)-piperidin-1-yl]-2-oxo-ethylamino}-acetic acid {[(1R)-2-((2S)-2-{[(3-{[AMINO(IMINO)METHYL]AMINO}PROPYL)AMINO]CARBONYL}PIPERIDINYL)-1-(CYCLOHEXYLMETHYL)-2-OXOETHYL]AMINO}ACETIC ACID
Type:
Small organic molecule
Emp. Form.:
C21H38N6O4
Mol. Mass.:
438.5642
SMILES:
NC(=N)NCCCNC(=O)[C@@H]1CCCCN1C(=O)[C@@H](CC1CCCCC1)NCC(O)=O
: