Target
Acetylcholinesterase
Ligand
BDBM8961
Substrate
Meas. Tech.
ChEMBL_1878605 (CHEMBL4379999)
IC50
23±n/a nM
Citation
 Wichur, TWi?ckowska, AWi?ckowski, KGody?, JJo?czyk, JValdivieso, ÁDRPanek, DPasieka, ASabaté, RKnez, DGobec, SMalawska, B 1-Benzylpyrrolidine-3-amine-based BuChE inhibitors with anti-aggregating, antioxidant and metal-chelating properties as multifunctional agents against Alzheimer's disease. Eur J Med Chem 187:0 (2020)  
Target
Name:
Acetylcholinesterase
Synonyms:
ACES_ELEEL Acetylcholinesterase (EeAChE) | ache
Type:
Enzyme
Mol. Mass.:
71812.79
Organism:
Electrophorus electricus (Electric eel)
Description:
Residue:
633
  
Inhibitor
Name:
BDBM8961
Synonyms:
1,2,3,4-tetrahydro-9-acridinamine 9-THA CHEMBL1337960 Cognex Tracine cid_1935 | tacrine.HCl
Type:
Small organic molecule
Emp. Form.:
C13H14N2
Mol. Mass.:
198.2637
SMILES:
Nc1c2CCCCc2nc2ccccc12
: