Target
Coagulation factor X
Ligand
BDBM50066618
Substrate
Meas. Tech.
ChEMBL_48800 (CHEMBL838886)
Ki
400±n/a nM
Citation
 Phillips, GDavey, DDEagen, KAKoovakkat, SKLiang, ANg, HPPinkerton, MTrinh, LWhitlow, MBeatty, AMMorrissey, MM Design, synthesis, and activity of 2,6-diphenoxypyridine-derived factor Xa inhibitors. J Med Chem 42:1749-56 (1999)  
Target
Name:
Coagulation factor X
Synonyms:
Activated coagulation factor X (FXa) Coagulation factor X precursor F10 Factor X heavy chain Factor Xa Stuart-Prower factor
Type:
Enzyme
Mol. Mass.:
54726.60
Organism:
Homo sapiens (Human)
Description:
Residue:
488
  
Inhibitor
Name:
BDBM50066618
Synonyms:
4-{6-[4-amino(imino)methylphenoxy]-2-pyridyloxy}phenyl-iminomethanamine | CHEMBL298415
Type:
Small organic molecule
Emp. Form.:
C19H17N5O2
Mol. Mass.:
347.3706
SMILES:
NC(=N)c1ccc(Oc2cccc(Oc3ccc(cc3)C(N)=N)n2)cc1
: