Target
Smoothened homolog
Ligand
BDBM50522400
Substrate
Meas. Tech.
ChEMBL_1886540 (CHEMBL4388217)
IC50
140±n/a nM
Citation
 Pace, JRTeske, KAChau, LQDash, RCZaino, AMWechsler-Reya, RJHadden, MK Structure-Activity Relationships for Itraconazole-Based Triazolone Analogues as Hedgehog Pathway Inhibitors. J Med Chem 62:3873-3885 (2019)  
Target
Name:
Smoothened homolog
Synonyms:
SMO_MOUSE Smoh
Type:
PROTEIN
Mol. Mass.:
87472.73
Organism:
Mus musculus
Description:
ChEMBL_1510377
Residue:
793
  
Inhibitor
Name:
BDBM50522400
Synonyms:
CHEMBL4562342
Type:
Small organic molecule
Emp. Form.:
C29H29Cl2N5O4
Mol. Mass.:
582.478
SMILES:
C[C@]1(OC[C@@H](COc2ccc(cc2)N2CCN(CC2)c2ccc(cc2)-n2cn[nH]c2=O)O1)c1ccc(Cl)cc1Cl
: