Target
Glucagon receptor
Ligand
BDBM50522712
Substrate
Meas. Tech.
ChEMBL_1888365 (CHEMBL4390042)
Ki
3000±n/a nM
Citation
 Song, FXu, GGaul, MDZhao, BLu, TZhang, RDesJarlais, RLDiLoreto, KHuebert, NShook, BRentzeperis, DSantulli, REckardt, ADemarest, K Design, synthesis and structure activity relationships of indazole and indole derivatives as potent glucagon receptor antagonists. Bioorg Med Chem Lett 29:1974-1980 (2019)  
Target
Name:
Glucagon receptor
Synonyms:
GCGR GLR_HUMAN Glucagon receptor (GlucR)
Type:
Enzyme
Mol. Mass.:
54026.92
Organism:
Homo sapiens (Human)
Description:
P47871
Residue:
477
  
Inhibitor
Name:
BDBM50522712
Synonyms:
CHEMBL4460356
Type:
Small organic molecule
Emp. Form.:
C32H36N4O4
Mol. Mass.:
540.6526
SMILES:
CC(C)CC(c1ccc(cc1)C(=O)NCCC(O)=O)n1ncc2cc(ccc12)-c1ccc(cc1)N1CCOCC1
: