Target
Glucagon receptor
Ligand
BDBM50522726
Substrate
Meas. Tech.
ChEMBL_1888365 (CHEMBL4390042)
Ki
1650±n/a nM
Citation
 Song, FXu, GGaul, MDZhao, BLu, TZhang, RDesJarlais, RLDiLoreto, KHuebert, NShook, BRentzeperis, DSantulli, REckardt, ADemarest, K Design, synthesis and structure activity relationships of indazole and indole derivatives as potent glucagon receptor antagonists. Bioorg Med Chem Lett 29:1974-1980 (2019)  
Target
Name:
Glucagon receptor
Synonyms:
GCGR GLR_HUMAN Glucagon receptor (GlucR)
Type:
Enzyme
Mol. Mass.:
54026.92
Organism:
Homo sapiens (Human)
Description:
P47871
Residue:
477
  
Inhibitor
Name:
BDBM50522726
Synonyms:
CHEMBL4560433
Type:
Small organic molecule
Emp. Form.:
C28H27Cl2N3O3
Mol. Mass.:
524.438
SMILES:
CC(C)CC(c1ccc(cc1)C(=O)NCCC(O)=O)n1ncc2cc(ccc12)-c1cc(Cl)cc(Cl)c1
: