Target
Glucagon receptor
Ligand
BDBM50522728
Substrate
Meas. Tech.
ChEMBL_1888365 (CHEMBL4390042)
Ki
85±n/a nM
Citation
 Song, FXu, GGaul, MDZhao, BLu, TZhang, RDesJarlais, RLDiLoreto, KHuebert, NShook, BRentzeperis, DSantulli, REckardt, ADemarest, K Design, synthesis and structure activity relationships of indazole and indole derivatives as potent glucagon receptor antagonists. Bioorg Med Chem Lett 29:1974-1980 (2019)  
Target
Name:
Glucagon receptor
Synonyms:
GCGR GLR_HUMAN Glucagon receptor (GlucR)
Type:
Enzyme
Mol. Mass.:
54026.92
Organism:
Homo sapiens (Human)
Description:
P47871
Residue:
477
  
Inhibitor
Name:
BDBM50522728
Synonyms:
CHEMBL4449022
Type:
Small organic molecule
Emp. Form.:
C31H31F3N2O3
Mol. Mass.:
536.5846
SMILES:
CC(C)CC(c1ccc(cc1)C(=O)NCCC(O)=O)n1ccc2cc(ccc12)-c1ccc(cc1C)C(F)(F)F
: