Target
Renin
Ligand
BDBM50077697
Substrate
Meas. Tech.
ChEMBL_195756 (CHEMBL803423)
IC50
110±n/a nM
Citation
 Güller, RBinggeli, ABreu, VBur, DFischli, WHirth, GJenny, CKansy, MMontavon, FMüller, MOefner, CStadler, HVieira, EWilhelm, MWostl, WMärki, HP Piperidine-renin inhibitors compounds with improved physicochemical properties. Bioorg Med Chem Lett 9:1403-8 (1999)  
Target
Name:
Renin
Synonyms:
Angiotensinogenase RENI_HUMAN
Type:
Enzyme
Mol. Mass.:
45058.99
Organism:
Homo sapiens (Human)
Description:
Residue:
406
  
Inhibitor
Name:
BDBM50077697
Synonyms:
7-((3R,4R)-4-{4-[3-(2-Methoxy-benzyloxy)-propoxy]-phenyl}-piperidin-3-yloxymethyl)-1H-quinolin-2-one | CHEMBL285046
Type:
Small organic molecule
Emp. Form.:
C32H36N2O5
Mol. Mass.:
528.6386
SMILES:
COc1ccccc1COCCCOc1ccc(cc1)[C@H]1CCNC[C@@H]1OCc1ccc2ccc(=O)[nH]c2c1
: