Target
Renin
Ligand
BDBM50077696
Substrate
Meas. Tech.
ChEMBL_195757 (CHEMBL803424)
IC50
12±n/a nM
Citation
 Güller, RBinggeli, ABreu, VBur, DFischli, WHirth, GJenny, CKansy, MMontavon, FMüller, MOefner, CStadler, HVieira, EWilhelm, MWostl, WMärki, HP Piperidine-renin inhibitors compounds with improved physicochemical properties. Bioorg Med Chem Lett 9:1403-8 (1999)  
Target
Name:
Renin
Synonyms:
Angiotensinogenase RENI_HUMAN
Type:
Enzyme
Mol. Mass.:
45058.99
Organism:
Homo sapiens (Human)
Description:
Residue:
406
  
Inhibitor
Name:
BDBM50077696
Synonyms:
4-[2-(7-{(3R,4R)-4-[4-(3-Benzyloxy-propoxy)-phenyl]-piperidin-3-yloxymethyl}-naphthalen-2-yloxy)-ethyl]-morpholine | CHEMBL285779
Type:
Small organic molecule
Emp. Form.:
C38H46N2O5
Mol. Mass.:
610.7822
SMILES:
C(COCc1ccccc1)COc1ccc(cc1)[C@H]1CCNC[C@@H]1OCc1ccc2ccc(OCCN3CCOCC3)cc2c1
: