Target
Renin
Ligand
BDBM50077703
Substrate
Meas. Tech.
ChEMBL_195757 (CHEMBL803424)
IC50
1.8±n/a nM
Citation
 Güller, RBinggeli, ABreu, VBur, DFischli, WHirth, GJenny, CKansy, MMontavon, FMüller, MOefner, CStadler, HVieira, EWilhelm, MWostl, WMärki, HP Piperidine-renin inhibitors compounds with improved physicochemical properties. Bioorg Med Chem Lett 9:1403-8 (1999)  
Target
Name:
Renin
Synonyms:
Angiotensinogenase RENI_HUMAN
Type:
Enzyme
Mol. Mass.:
45058.99
Organism:
Homo sapiens (Human)
Description:
Residue:
406
  
Inhibitor
Name:
BDBM50077703
Synonyms:
4-{2-[(3S,4R,5R)-4-[4-(3-Benzyloxy-propoxy)-phenyl]-5-(naphthalen-2-ylmethoxy)-piperidin-3-yloxy]-ethyl}-morpholine | CHEMBL287023
Type:
Small organic molecule
Emp. Form.:
C38H46N2O5
Mol. Mass.:
610.7822
SMILES:
C(COCc1ccccc1)COc1ccc(cc1)[C@H]1[C@@H](CNC[C@@H]1OCc1ccc2ccccc2c1)OCCN1CCOCC1
: