Target
Renin
Ligand
BDBM50077706
Substrate
Meas. Tech.
ChEMBL_195757 (CHEMBL803424)
IC50
12±n/a nM
Citation
 Güller, RBinggeli, ABreu, VBur, DFischli, WHirth, GJenny, CKansy, MMontavon, FMüller, MOefner, CStadler, HVieira, EWilhelm, MWostl, WMärki, HP Piperidine-renin inhibitors compounds with improved physicochemical properties. Bioorg Med Chem Lett 9:1403-8 (1999)  
Target
Name:
Renin
Synonyms:
Angiotensinogenase RENI_HUMAN
Type:
Enzyme
Mol. Mass.:
45058.99
Organism:
Homo sapiens (Human)
Description:
Residue:
406
  
Inhibitor
Name:
BDBM50077706
Synonyms:
7-{(3R,4R)-4-[4-(3-Benzyloxy-propoxy)-phenyl]-piperidin-3-yloxymethyl}-quinoline | CHEMBL265984
Type:
Small organic molecule
Emp. Form.:
C31H34N2O3
Mol. Mass.:
482.6133
SMILES:
C(COCc1ccccc1)COc1ccc(cc1)[C@H]1CCNC[C@@H]1OCc1ccc2cccnc2c1
: