Target
Renin
Ligand
BDBM50077705
Substrate
Meas. Tech.
ChEMBL_195757 (CHEMBL803424)
IC50
6.4±n/a nM
Citation
 Güller, RBinggeli, ABreu, VBur, DFischli, WHirth, GJenny, CKansy, MMontavon, FMüller, MOefner, CStadler, HVieira, EWilhelm, MWostl, WMärki, HP Piperidine-renin inhibitors compounds with improved physicochemical properties. Bioorg Med Chem Lett 9:1403-8 (1999)  
Target
Name:
Renin
Synonyms:
Angiotensinogenase RENI_HUMAN
Type:
Enzyme
Mol. Mass.:
45058.99
Organism:
Homo sapiens (Human)
Description:
Residue:
406
  
Inhibitor
Name:
BDBM50077705
Synonyms:
(3S,4S,5R)-4-[4-(3-Benzyloxy-propoxy)-phenyl]-5-(naphthalen-2-ylmethoxy)-piperidin-3-ol | CHEMBL281299
Type:
Small organic molecule
Emp. Form.:
C32H35NO4
Mol. Mass.:
497.6246
SMILES:
O[C@@H]1CNC[C@H](OCc2ccc3ccccc3c2)[C@H]1c1ccc(OCCCOCc2ccccc2)cc1
: