Target
Renin
Ligand
BDBM50077693
Substrate
Meas. Tech.
ChEMBL_195757 (CHEMBL803424)
IC50
0.500000±n/a nM
Citation
 Güller, RBinggeli, ABreu, VBur, DFischli, WHirth, GJenny, CKansy, MMontavon, FMüller, MOefner, CStadler, HVieira, EWilhelm, MWostl, WMärki, HP Piperidine-renin inhibitors compounds with improved physicochemical properties. Bioorg Med Chem Lett 9:1403-8 (1999)  
Target
Name:
Renin
Synonyms:
Angiotensinogenase RENI_HUMAN
Type:
Enzyme
Mol. Mass.:
45058.99
Organism:
Homo sapiens (Human)
Description:
Residue:
406
  
Inhibitor
Name:
BDBM50077693
Synonyms:
(3'R,4'R)-3'-(1,4-Dimethoxy-naphthalen-2-ylmethoxy)-6-[3-(2-methoxy-benzyloxy)-propoxy]-1',2',3',4',5',6'-hexahydro-[3,4']bipyridinyl | CHEMBL285146
Type:
Small organic molecule
Emp. Form.:
C34H40N2O6
Mol. Mass.:
572.6912
SMILES:
COc1ccccc1COCCCOc1ccc(cn1)[C@H]1CCNC[C@@H]1OCc1cc(OC)c2ccccc2c1OC
: