Target
Renin
Ligand
BDBM50077678
Substrate
Meas. Tech.
ChEMBL_195756 (CHEMBL803423)
IC50
12±n/a nM
Citation
 Güller, RBinggeli, ABreu, VBur, DFischli, WHirth, GJenny, CKansy, MMontavon, FMüller, MOefner, CStadler, HVieira, EWilhelm, MWostl, WMärki, HP Piperidine-renin inhibitors compounds with improved physicochemical properties. Bioorg Med Chem Lett 9:1403-8 (1999)  
Target
Name:
Renin
Synonyms:
Angiotensinogenase RENI_HUMAN
Type:
Enzyme
Mol. Mass.:
45058.99
Organism:
Homo sapiens (Human)
Description:
Residue:
406
  
Inhibitor
Name:
BDBM50077678
Synonyms:
(3R,4R)-3-(1,4-Dimethoxy-naphthalen-2-ylmethoxy)-4-{4-[3-(2-methoxy-benzyloxy)-propoxy]-phenyl}-piperidine | CHEMBL430539
Type:
Small organic molecule
Emp. Form.:
C35H41NO6
Mol. Mass.:
571.7031
SMILES:
COc1ccccc1COCCCOc1ccc(cc1)[C@H]1CCNC[C@@H]1OCc1cc(OC)c2ccccc2c1OC
: