Target
Tyrosine-protein kinase BTK
Ligand
BDBM50276123
Substrate
Meas. Tech.
ChEMBL_1888588 (CHEMBL4390265)
IC50
396±n/a nM
Citation
 Diao, YFang, XSong, PLai, MTong, LHao, YDou, DLiu, YDing, JZhao, ZXie, HLi, H Discovery and Biological evaluation of pyrimido[4,5-d]pyrimidine-2,4(1H,3H)-dione derivatives as potent Bruton's tyrosine kinase inhibitors. Bioorg Med Chem 27:3390-3395 (2019)  
Target
Name:
Tyrosine-protein kinase BTK
Synonyms:
AGMX1 Agammaglobulinaemia tyrosine kinase B cell progenitor kinase BPK BTK_HUMAN Tyrosine Kinase BTK Tyrosine-protein kinase BTK (BTK)
Type:
Enzyme
Mol. Mass.:
76289.95
Organism:
Homo sapiens (Human)
Description:
Q06187
Residue:
659
  
Inhibitor
Name:
BDBM50276123
Synonyms:
CHEMBL4126358
Type:
Small organic molecule
Emp. Form.:
C31H36N8O4
Mol. Mass.:
584.6687
SMILES:
CCn1c(=O)n(-c2cccc(NC(=O)C=C)c2)c2nc(Nc3ccc(cc3OC)N3CCC(CC3)N(C)C)ncc2c1=O
: