Target
Tyrosine-protein kinase BTK
Ligand
BDBM50276097
Substrate
Meas. Tech.
ChEMBL_1888588 (CHEMBL4390265)
IC50
982±n/a nM
Citation
 Diao, YFang, XSong, PLai, MTong, LHao, YDou, DLiu, YDing, JZhao, ZXie, HLi, H Discovery and Biological evaluation of pyrimido[4,5-d]pyrimidine-2,4(1H,3H)-dione derivatives as potent Bruton's tyrosine kinase inhibitors. Bioorg Med Chem 27:3390-3395 (2019)  
Target
Name:
Tyrosine-protein kinase BTK
Synonyms:
AGMX1 Agammaglobulinaemia tyrosine kinase B cell progenitor kinase BPK BTK_HUMAN Tyrosine Kinase BTK Tyrosine-protein kinase BTK (BTK)
Type:
Enzyme
Mol. Mass.:
76289.95
Organism:
Homo sapiens (Human)
Description:
Q06187
Residue:
659
  
Inhibitor
Name:
BDBM50276097
Synonyms:
CHEMBL4129902
Type:
Small organic molecule
Emp. Form.:
C30H36N8O4
Mol. Mass.:
572.658
SMILES:
COc1cc(ccc1Nc1ncc2c(n1)n(-c1cccc(NC(=O)C=C)c1)c(=O)n(C(C)C)c2=O)N(C)CCN(C)C
: