Target
Nuclear receptor ROR-gamma
Ligand
BDBM253441
Substrate
Meas. Tech.
ChEMBL_1888779 (CHEMBL4390456)
EC50
1260±n/a nM
Citation
 Lu, ZDuan, JJXiao, HNeels, JWu, DRWeigelt, CASack, JSKhan, JRuzanov, MAn, YYarde, MKarmakar, AVishwakrishnan, SBaratam, VShankarappa, HVanteru, SBabu, VBasha, MKumar Gupta, AKumaravel, SMathur, AZhao, QSalter-Cid, LMCarter, PHMurali Dhar, TG Identification of potent, selective and orally bioavailable phenyl ((R)-3-phenylpyrrolidin-3-yl)sulfone analogues as ROR?t inverse agonists. Bioorg Med Chem Lett 29:2265-2269 (2019)  
Target
Name:
Nuclear receptor ROR-gamma
Synonyms:
NR1F3 Nuclear receptor ROR-gamma (RORC) RAR-related orphan receptor C (RORc) RORG RZRG Retinoid-related orphan receptor-gamma (RORc)
Type:
Enzyme Catalytic Domain
Mol. Mass.:
58218.40
Organism:
Homo sapiens (Human)
Description:
P51449
Residue:
518
  
Inhibitor
Name:
BDBM253441
Synonyms:
US9458171, 401
Type:
Small organic molecule
Emp. Form.:
C27H25F8N5O3S
Mol. Mass.:
651.571
SMILES:
Fc1ccc(cc1)S(=O)(=O)[C@]1(CCN(C1)C(=O)[C@H]1CC[C@@H](CC1)c1nnn[nH]1)c1ccc(cc1)C(F)(C(F)(F)F)C(F)(F)F
: