Target
Nuclear receptor subfamily 1 group I member 2
Ligand
BDBM50522994
Substrate
Meas. Tech.
ChEMBL_1888780 (CHEMBL4390457)
EC50
>50000±n/a nM
Citation
 Lu, ZDuan, JJXiao, HNeels, JWu, DRWeigelt, CASack, JSKhan, JRuzanov, MAn, YYarde, MKarmakar, AVishwakrishnan, SBaratam, VShankarappa, HVanteru, SBabu, VBasha, MKumar Gupta, AKumaravel, SMathur, AZhao, QSalter-Cid, LMCarter, PHMurali Dhar, TG Identification of potent, selective and orally bioavailable phenyl ((R)-3-phenylpyrrolidin-3-yl)sulfone analogues as ROR?t inverse agonists. Bioorg Med Chem Lett 29:2265-2269 (2019)  
Target
Name:
Nuclear receptor subfamily 1 group I member 2
Synonyms:
NR1I2 Orphan nuclear receptor PAR1 PXR SXR nuclear receptor subfamily 1 group I member 2 isoform 1
Type:
Nuclear receptor
Mol. Mass.:
49774.77
Organism:
Homo sapiens (Human)
Description:
O75469
Residue:
434
  
Inhibitor
Name:
BDBM50522994
Synonyms:
CHEMBL4513846
Type:
Small organic molecule
Emp. Form.:
C28H27F8NO5S
Mol. Mass.:
641.57
SMILES:
C[C@@]1(CC[C@@H](CC1)C(O)=O)C(=O)N1CC[C@](C1)(c1ccc(cc1)C(F)(C(F)(F)F)C(F)(F)F)S(=O)(=O)c1ccc(F)cc1
: