Target
Nuclear receptor ROR-alpha
Ligand
BDBM253539
Substrate
Meas. Tech.
ChEMBL_1888783 (CHEMBL4390460)
EC50
>40000±n/a nM
Citation
 Lu, ZDuan, JJXiao, HNeels, JWu, DRWeigelt, CASack, JSKhan, JRuzanov, MAn, YYarde, MKarmakar, AVishwakrishnan, SBaratam, VShankarappa, HVanteru, SBabu, VBasha, MKumar Gupta, AKumaravel, SMathur, AZhao, QSalter-Cid, LMCarter, PHMurali Dhar, TG Identification of potent, selective and orally bioavailable phenyl ((R)-3-phenylpyrrolidin-3-yl)sulfone analogues as ROR?t inverse agonists. Bioorg Med Chem Lett 29:2265-2269 (2019)  
Target
Name:
Nuclear receptor ROR-alpha
Synonyms:
NR1F1 Nuclear receptor subfamily 1 group F member 1 RORA RZRA | Retinoid-related orphan receptor-alpha
Type:
PROTEIN
Mol. Mass.:
58976.26
Organism:
Homo sapiens (Human)
Description:
ChEMBL_101591
Residue:
523
  
Inhibitor
Name:
BDBM253539
Synonyms:
US9458171, 499
Type:
Small organic molecule
Emp. Form.:
C27H27F8NO5S2
Mol. Mass.:
661.624
SMILES:
CCC1(CCS(=O)(=O)CC1)C(=O)N1CC[C@](C1)(c1ccc(cc1)C(F)(C(F)(F)F)C(F)(F)F)S(=O)(=O)c1ccc(F)cc1
: