Target
Oxysterols receptor LXR-alpha
Ligand
BDBM253529
Substrate
Meas. Tech.
ChEMBL_1888785 (CHEMBL4390462)
EC50
>7500±n/a nM
Citation
 Lu, ZDuan, JJXiao, HNeels, JWu, DRWeigelt, CASack, JSKhan, JRuzanov, MAn, YYarde, MKarmakar, AVishwakrishnan, SBaratam, VShankarappa, HVanteru, SBabu, VBasha, MKumar Gupta, AKumaravel, SMathur, AZhao, QSalter-Cid, LMCarter, PHMurali Dhar, TG Identification of potent, selective and orally bioavailable phenyl ((R)-3-phenylpyrrolidin-3-yl)sulfone analogues as ROR?t inverse agonists. Bioorg Med Chem Lett 29:2265-2269 (2019)  
Target
Name:
Oxysterols receptor LXR-alpha
Synonyms:
LXRA Liver X receptor alpha Liver X receptor alpha (NR1H3) NR1H3 Nuclear orphan receptor LXR-alpha | Nuclear receptor subfamily 1 group H member 3
Type:
Enzyme Catalytic Domain
Mol. Mass.:
50403.85
Organism:
Homo sapiens (Human)
Description:
Q13133
Residue:
447
  
Inhibitor
Name:
BDBM253529
Synonyms:
US9458171, 489
Type:
Small organic molecule
Emp. Form.:
C24H21F8NO5S2
Mol. Mass.:
619.544
SMILES:
Fc1ccc(cc1)S(=O)(=O)[C@]1(CCN(C1)C(=O)C1CCS(=O)(=O)C1)c1ccc(cc1)C(F)(C(F)(F)F)C(F)(F)F
: