Target
Nuclear receptor ROR-beta
Ligand
BDBM253558
Substrate
Meas. Tech.
ChEMBL_1888784 (CHEMBL4390461)
EC50
>40000±n/a nM
Citation
 Lu, ZDuan, JJXiao, HNeels, JWu, DRWeigelt, CASack, JSKhan, JRuzanov, MAn, YYarde, MKarmakar, AVishwakrishnan, SBaratam, VShankarappa, HVanteru, SBabu, VBasha, MKumar Gupta, AKumaravel, SMathur, AZhao, QSalter-Cid, LMCarter, PHMurali Dhar, TG Identification of potent, selective and orally bioavailable phenyl ((R)-3-phenylpyrrolidin-3-yl)sulfone analogues as ROR?t inverse agonists. Bioorg Med Chem Lett 29:2265-2269 (2019)  
Target
Name:
Nuclear receptor ROR-beta
Synonyms:
NR1F2 Nuclear receptor subfamily 1 group F member 2 RORB_HUMAN Retinoid-related orphan receptor-beta
Type:
PROTEIN
Mol. Mass.:
53227.30
Organism:
Homo sapiens (Human)
Description:
ChEMBL_107979
Residue:
470
  
Inhibitor
Name:
BDBM253558
Synonyms:
US9458171, 519
Type:
Small organic molecule
Emp. Form.:
C25H22F9NO5S2
Mol. Mass.:
651.562
SMILES:
Fc1ccc(cc1)S(=O)(=O)[C@]1(CCN(C1)C(=O)C1(F)CCS(=O)(=O)CC1)c1ccc(cc1)C(F)(C(F)(F)F)C(F)(F)F
: