Target
Cytochrome P450 2C8
Ligand
BDBM253427
Substrate
Meas. Tech.
ChEMBL_1888794 (CHEMBL4390471)
IC50
>10000±n/a nM
Citation
 Lu, ZDuan, JJXiao, HNeels, JWu, DRWeigelt, CASack, JSKhan, JRuzanov, MAn, YYarde, MKarmakar, AVishwakrishnan, SBaratam, VShankarappa, HVanteru, SBabu, VBasha, MKumar Gupta, AKumaravel, SMathur, AZhao, QSalter-Cid, LMCarter, PHMurali Dhar, TG Identification of potent, selective and orally bioavailable phenyl ((R)-3-phenylpyrrolidin-3-yl)sulfone analogues as ROR?t inverse agonists. Bioorg Med Chem Lett 29:2265-2269 (2019)  
Target
Name:
Cytochrome P450 2C8
Synonyms:
CP2C8_HUMAN CYPIIC8 P450 IIC2 P450 form 1 | S-mephenytoin 4-hydroxylase
Type:
Protein
Mol. Mass.:
55839.23
Organism:
Homo sapiens (Human)
Description:
P10632
Residue:
490
  
Inhibitor
Name:
BDBM253427
Synonyms:
US9458171, 387
Type:
Small organic molecule
Emp. Form.:
C29H29F8NO5S
Mol. Mass.:
655.596
SMILES:
CC[C@@]1(CC[C@@H](CC1)C(O)=O)C(=O)N1CC[C@](C1)(c1ccc(cc1)C(F)(C(F)(F)F)C(F)(F)F)S(=O)(=O)c1ccc(F)cc1
: