Target
5-hydroxytryptamine receptor 2C
Ligand
BDBM50078063
Substrate
Meas. Tech.
ChEMBL_2804 (CHEMBL617656)
IC50
13±n/a nM
Citation
 Liao, YVenhuis, BJRodenhuis, NTimmerman, WWikström, HMeier, EBartoszyk, GDBöttcher, HSeyfried, CASundell, S New (sulfonyloxy)piperazinyldibenzazepines as potential atypical antipsychotics: chemistry and pharmacological evaluation. J Med Chem 42:2235-44 (1999)  
Target
Name:
5-hydroxytryptamine receptor 2C
Synonyms:
5-HT2C 5-hydroxytryptamine receptor 2C (5HT2c) 5ht1c Htr2c Serotonin receptor 2a and 2c (5HT2A and 5HT2C)
Type:
Enzyme
Mol. Mass.:
51935.10
Organism:
Rattus norvegicus (Rat)
Description:
P08909
Residue:
460
  
Inhibitor
Name:
BDBM50078063
Synonyms:
CHEMBL70319 | Trifluoro-methanesulfonic acid 8-chloro-11-(4-methyl-piperazin-1-yl)-5H-dibenzo[b,e][1,4]diazepin-2-yl ester
Type:
Small organic molecule
Emp. Form.:
C19H18ClF3N4O3S
Mol. Mass.:
474.884
SMILES:
CN1CCN(CC1)C1=Nc2cc(Cl)ccc2Nc2ccc(OS(=O)(=O)C(F)(F)F)cc12
: