Target
5-hydroxytryptamine receptor 2C
Ligand
BDBM50061555
Substrate
Meas. Tech.
ChEMBL_2804 (CHEMBL617656)
IC50
86±n/a nM
Citation
 Liao, YVenhuis, BJRodenhuis, NTimmerman, WWikström, HMeier, EBartoszyk, GDBöttcher, HSeyfried, CASundell, S New (sulfonyloxy)piperazinyldibenzazepines as potential atypical antipsychotics: chemistry and pharmacological evaluation. J Med Chem 42:2235-44 (1999)  
Target
Name:
5-hydroxytryptamine receptor 2C
Synonyms:
5-HT2C 5-hydroxytryptamine receptor 2C (5HT2c) 5ht1c Htr2c Serotonin receptor 2a and 2c (5HT2A and 5HT2C)
Type:
Enzyme
Mol. Mass.:
51935.10
Organism:
Rattus norvegicus (Rat)
Description:
P08909
Residue:
460
  
Inhibitor
Name:
BDBM50061555
Synonyms:
8-Methoxy-11-(4-methyl-piperazin-1-yl)-5H-dibenzo[b,e][1,4]diazepine | CHEMBL73074
Type:
Small organic molecule
Emp. Form.:
C19H22N4O
Mol. Mass.:
322.4042
SMILES:
COc1ccc2Nc3ccccc3C(=Nc2c1)N1CCN(C)CC1
: