Target
Cytochrome P450 2C8
Ligand
BDBM50523014
Substrate
Meas. Tech.
ChEMBL_1888856 (CHEMBL4390533)
IC50
>50000±n/a nM
Citation
 Harada, KMizukami, JWatanabe, TMori, GUbukata, MSuwa, KFukuda, SNegoro, TSato, MInaba, T Optimization of oxadiazole derivatives with a spirocyclic cyclohexane structure as novel GPR119 agonists. Bioorg Med Chem Lett 29:2100-2106 (2019)  
Target
Name:
Cytochrome P450 2C8
Synonyms:
CP2C8_HUMAN CYPIIC8 P450 IIC2 P450 form 1 | S-mephenytoin 4-hydroxylase
Type:
Protein
Mol. Mass.:
55839.23
Organism:
Homo sapiens (Human)
Description:
P10632
Residue:
490
  
Inhibitor
Name:
BDBM50523014
Synonyms:
CHEMBL4548931
Type:
Small organic molecule
Emp. Form.:
C22H26F4N2O5S
Mol. Mass.:
506.511
SMILES:
C[C@@H](O[C@H]1CC[C@@]2(CC1)CCC(F)(F)CO2)c1nc(no1)-c1cc(F)c(CS(C)(=O)=O)c(F)c1
: