Target
1-phosphatidylinositol 4,5-bisphosphate phosphodiesterase beta-1
Ligand
BDBM50079183
Substrate
Meas. Tech.
ChEMBL_156498 (CHEMBL761003)
EC50
65000±n/a nM
Citation
 Pellicciari, RMarinozzi, MCostantino, GNatalini, BMoroni, FPellegrini-Giampietro, D (2R,1'S,2'R,3'S)-2-(2'-Carboxy-3'-phenylcyclopropyl)glycine (PCCG-13), the first potent and selective competitive antagonist of phospholipase D-coupled metabotropic glutamate receptors: asymmetric synthesis and preliminary biological properties. J Med Chem 42:2716-20 (1999)  
Target
Name:
1-phosphatidylinositol 4,5-bisphosphate phosphodiesterase beta-1
Synonyms:
KIAA0581 PLCB1_HUMAN | Phospholipase C-beta-1
Type:
PROTEIN
Mol. Mass.:
138559.20
Organism:
Homo sapiens (Human)
Description:
ChEMBL_156499
Residue:
1216
  
Inhibitor
Name:
BDBM50079183
Synonyms:
(2S)-amino(3,5-dihydroxyphenyl)ethanoic acid (S)-Amino-(3,5-dihydroxy-phenyl)-acetic acid Amino-(3,5-dihydroxy-phenyl)-acetic acid CHEMBL39221 | amino(3,5-dihydroxyphenyl)acetic acid
Type:
Small organic molecule
Emp. Form.:
C8H9NO4
Mol. Mass.:
183.1614
SMILES:
N[C@H](C(O)=O)c1cc(O)cc(O)c1
: