Target
Nuclear receptor ROR-gamma
Ligand
BDBM50524230
Substrate
Meas. Tech.
ChEMBL_1892509 (CHEMBL4394430)
IC50
90±n/a nM
Citation
 Zhang, YWu, XXue, XLi, CWang, JWang, RZhang, CWang, CShi, YZou, LLi, QHuang, ZHao, XLoomes, KWu, DChen, HWXu, JXu, Y Discovery and Characterization of XY101, a Potent, Selective, and Orally Bioavailable ROR? Inverse Agonist for Treatment of Castration-Resistant Prostate Cancer. J Med Chem 62:4716-4730 (2019)  
Target
Name:
Nuclear receptor ROR-gamma
Synonyms:
NR1F3 Nuclear receptor ROR-gamma (RORC) RAR-related orphan receptor C (RORc) RORG RZRG Retinoid-related orphan receptor-gamma (RORc)
Type:
Enzyme Catalytic Domain
Mol. Mass.:
58218.40
Organism:
Homo sapiens (Human)
Description:
P51449
Residue:
518
  
Inhibitor
Name:
BDBM50524230
Synonyms:
CHEMBL4455520
Type:
Small organic molecule
Emp. Form.:
C24H18F7NO5S
Mol. Mass.:
565.457
SMILES:
COC(=O)c1ccc(CS(=O)(=O)Nc2ccc(cc2)-c2ccc(cc2F)C(O)(C(F)(F)F)C(F)(F)F)cc1
: