Target
ALK tyrosine kinase receptor
Ligand
BDBM50524979
Substrate
Meas. Tech.
ChEMBL_1895110 (CHEMBL4397145)
IC50
2.9±n/a nM
Citation
 Fushimi, MFujimori, IWakabayashi, THasui, TKawakita, YImamura, KKato, TMurakami, MIshii, TKikko, YKasahara, MNakatani, AHiura, YMiyamoto, MSaikatendu, KZou, HLane, SWLawson, JDImoto, H Discovery of Potent, Selective, and Brain-Penetrant 1 H-Pyrazol-5-yl-1 H-pyrrolo[2,3- b]pyridines as Anaplastic Lymphoma Kinase (ALK) Inhibitors. J Med Chem 62:4915-4935 (2019)  
Target
Name:
ALK tyrosine kinase receptor
Synonyms:
ALK ALK_HUMAN CD_antigen: CD246
Type:
Protein
Mol. Mass.:
176453.10
Organism:
Homo sapiens (Human)
Description:
Q9UM73
Residue:
1620
  
Inhibitor
Name:
BDBM50524979
Synonyms:
CHEMBL4440381
Type:
Small organic molecule
Emp. Form.:
C24H25FN6O3
Mol. Mass.:
464.4921
SMILES:
C[C@H](Oc1ccc2c(cn(-c3cc(C)[nH]n3)c2n1)C(=O)N1CCO[C@@H](C)C1)c1ccc(F)cn1
: