Target
DNA topoisomerase 2-alpha/2-beta
Ligand
BDBM50525581
Substrate
Meas. Tech.
ChEMBL_1897521 (CHEMBL4399556)
IC50
230±n/a nM
Citation
 Othman, DIASelim, KBEl-Sayed, MATantawy, ASAmen, YShimizu, KOkauchi, TKitamura, M Design, Synthesis and Anticancer Evaluation of New Substituted Thiophene-Quinoline Derivatives. Bioorg Med Chem 27:0 (2019)  
Target
Name:
DNA topoisomerase 2-alpha/2-beta
Synonyms:
DNA topoisomerase II
Type:
Mol. Mass.:
Description:
ASSAY_ID of ChEMBL is 1821483
Components:
This complex has 2 components.
Component 1
Name:
DNA topoisomerase 2-alpha
Synonyms:
DNA topoisomerase 2-alpha DNA topoisomerase II (Topo II) DNA topoisomerase II, alpha isozyme TOP2A Topoisomerase I/II | Topoisomerase II alpha (HuTopoIIα)
Type:
Protein
Mol. Mass.:
174415.30
Organism:
Homo sapiens (Human)
Description:
P11388
Residue:
1531
  
Component 2
Name:
DNA topoisomerase 2-beta
Synonyms:
DNA topoisomerase II TOP2B | TOP2B_HUMAN
Type:
PROTEIN
Mol. Mass.:
183284.13
Organism:
Homo sapiens (Human)
Description:
ChEMBL_51583
Residue:
1626
  
Inhibitor
Name:
BDBM50525581
Synonyms:
CHEMBL4469453
Type:
Small organic molecule
Emp. Form.:
C21H15ClFNOS
Mol. Mass.:
383.866
SMILES:
Fc1ccc(COC(c2cccs2)c2cc3ccccc3nc2Cl)cc1
: