Target
Calpain-1 catalytic subunit
Ligand
BDBM50080220
Substrate
Meas. Tech.
ChEMBL_43873 (CHEMBL658533)
Ki
10±n/a nM
Citation
 Chatterjee, SDunn, DTao, MWells, GGu, ZQBihovsky, RAtor, MASiman, RMallamo, JP P2-achiral, P'-extended alpha-ketoamide inhibitors of calpain I. Bioorg Med Chem Lett 9:2371-4 (1999)  
Target
Name:
Calpain-1 catalytic subunit
Synonyms:
CAN1_HUMAN CAPN1 Calpain-1 (u-Calpain) Calpain1
Type:
Protein
Mol. Mass.:
81880.51
Organism:
Homo sapiens (Human)
Description:
Residue:
714
  
Inhibitor
Name:
BDBM50080220
Synonyms:
(S)-3-((R)-3-Benzyloxy-2-methanesulfonylamino-propionylamino)-2-oxo-4-phenyl-N-[2-(5-pyridin-2-yl-thiophene-2-sulfonylamino)-ethyl]-butyramide | CHEMBL78843
Type:
Small organic molecule
Emp. Form.:
C32H35N5O8S3
Mol. Mass.:
713.844
SMILES:
CS(=O)(=O)N[C@H](COCc1ccccc1)C(=O)N[C@@H](Cc1ccccc1)C(=O)C(=O)NCCNS(=O)(=O)c1ccc(s1)-c1ccccn1
: