Target
Cysteinyl leukotriene receptor 1
Ligand
BDBM50023198
Substrate
Meas. Tech.
ChEMBL_52384 (CHEMBL663216)
Ki
0.800000±n/a nM
Citation
 Chambers, RJMarfat, AAntognoli, GWCheng, JBDamon, DBKuperman, AVListon, TCMebus, CPillar, JSShirley, JTWatson, JW Discovery of CP-199,330 and CP-199,331: two potent and orally efficacious cysteinyl LT1 receptor antagonists devoid of liver toxicity. Bioorg Med Chem Lett 9:2773-8 (1999)  
Target
Name:
Cysteinyl leukotriene receptor 1
Synonyms:
CLTR1_CAVPO | CYSLTR1
Type:
Enzyme Catalytic Domain
Mol. Mass.:
39007.58
Organism:
GUINEA PIG
Description:
Leukotriene D4 0 GUINEA PIG::Q2NNR5
Residue:
340
  
Inhibitor
Name:
BDBM50023198
Synonyms:
8-[4-(4-phenylbutyloxy)benzoyl]amino-2-(tetrazol-5-yl)-4-oxo-4H-1-benzopyran N-(4-oxo-2-(1H-tetrazol-5-yl)-4H-chromen-8-yl)-4-(4-phenylbutoxy)benzamide N-[4-Oxo-2-(1H-tetrazol-5-yl)-4H-chromen-8-yl]-4-(4-phenyl-butoxy)-benzamide (ONO-RS-411) ONO-1078 | PRANLUKAST
Type:
Small organic molecule
Emp. Form.:
C27H23N5O4
Mol. Mass.:
481.5026
SMILES:
O=C(Nc1cccc2c1oc(cc2=O)-c1nnn[nH]1)c1ccc(OCCCCc2ccccc2)cc1
: