Target
Integrase
Ligand
BDBM50062551
Substrate
Meas. Tech.
ChEMBL_1900979 (CHEMBL4403201)
EC50
3.6±n/a nM
Citation
 Huang, YMAlharbi, NSSun, BShantharam, CSRakesh, KPQin, HL Synthetic routes and structure-activity relationships (SAR) of anti-HIV agents: A key review. Eur J Med Chem 181:0 (2019)  
Target
Name:
Integrase
Synonyms:
pol
Type:
PROTEIN
Mol. Mass.:
32203.43
Organism:
Human immunodeficiency virus 1
Description:
ChEMBL_106649
Residue:
288
  
Inhibitor
Name:
BDBM50062551
Synonyms:
CHEBI:76010 GSK1349572 | S-349572
Type:
Small organic molecule
Emp. Form.:
C20H19F2N3O5
Mol. Mass.:
419.3788
SMILES:
[H][C@]12Cn3cc(C(=O)NCc4ccc(F)cc4F)c(=O)c(O)c3C(=O)N1[C@H](C)CCO2
: