Target
Glutathione S-transferase omega-1
Ligand
BDBM50527166
Substrate
Meas. Tech.
ChEMBL_1902456 (CHEMBL4404678)
IC50
250±n/a nM
Citation
 Xie, YTummala, POakley, AJDeora, GSNakano, YRooke, MCuellar, MEStrasser, JMDahlin, JLWalters, MACasarotto, MGBoard, PGBaell, JB Development of Benzenesulfonamide Derivatives as Potent Glutathione Transferase Omega-1 Inhibitors. J Med Chem 63:2894-2914 (2020)  
Target
Name:
Glutathione S-transferase omega-1
Synonyms:
GSTO 1-1 GSTO1_HUMAN Glutathione S-transferase omega-1 glutathione S-transferase omega-1 isoform 1
Type:
PROTEIN
Mol. Mass.:
27565.54
Organism:
Homo sapiens (Human)
Description:
EBI_11172
Residue:
241
  
Inhibitor
Name:
BDBM50527166
Synonyms:
CHEMBL4589666
Type:
Small organic molecule
Emp. Form.:
C13H14ClF3N2O4S
Mol. Mass.:
386.774
SMILES:
FC(F)(F)c1ccc(NC(=O)CCl)cc1S(=O)(=O)N1CCOCC1
: