Target
Glutathione S-transferase omega-1
Ligand
BDBM50527188
Substrate
Meas. Tech.
ChEMBL_1902456 (CHEMBL4404678)
IC50
180±n/a nM
Citation
 Xie, YTummala, POakley, AJDeora, GSNakano, YRooke, MCuellar, MEStrasser, JMDahlin, JLWalters, MACasarotto, MGBoard, PGBaell, JB Development of Benzenesulfonamide Derivatives as Potent Glutathione Transferase Omega-1 Inhibitors. J Med Chem 63:2894-2914 (2020)  
Target
Name:
Glutathione S-transferase omega-1
Synonyms:
GSTO 1-1 GSTO1_HUMAN Glutathione S-transferase omega-1 glutathione S-transferase omega-1 isoform 1
Type:
PROTEIN
Mol. Mass.:
27565.54
Organism:
Homo sapiens (Human)
Description:
EBI_11172
Residue:
241
  
Inhibitor
Name:
BDBM50527188
Synonyms:
CHEMBL4465385
Type:
Small organic molecule
Emp. Form.:
C11H14Cl2N2O4S
Mol. Mass.:
341.211
SMILES:
CN(CCO)S(=O)(=O)c1cc(NC(=O)CCl)ccc1Cl
: