Target
Tyrosine-protein kinase ABL1
Ligand
BDBM66241
Substrate
Meas. Tech.
ChEMBL_1911690 (CHEMBL4414136)
EC50
794±n/a nM
Citation
 Simpson, GLBertrand, SMBorthwick, JACampobasso, NChabanet, JChen, SCoggins, JCottom, JChristensen, SBDawson, HCEvans, HLHobbs, ANHong, XMangatt, BMunoz-Muriedas, JOliff, AQin, DScott-Stevens, PWard, PWashio, YYang, JYoung, RJ Identification and Optimization of Novel Small c-Abl Kinase Activators Using Fragment and HTS Methodologies. J Med Chem 62:2154-2171 (2019)  
Target
Name:
Tyrosine-protein kinase ABL1
Synonyms:
ABL ABL1_HUMAN JTK7 Proto-oncogene tyrosine-protein kinase ABL1 Tyrosine-protein kinase ABL V-abl Abelson murine leukemia viral oncogene homolog 1 p150 | tyrosine-protein kinase ABL1 isoform a
Type:
Enzyme
Mol. Mass.:
122897.30
Organism:
Homo sapiens (Human)
Description:
P00519
Residue:
1130
  
Inhibitor
Name:
BDBM66241
Synonyms:
5-[3-(4-fluorophenyl)-1-phenyl-4-pyrazolyl]imidazolidine-2,4-dione 5-[3-(4-fluorophenyl)-1-phenyl-pyrazol-4-yl]imidazolidine-2,4-dione MLS000036279 cid_660311
Type:
Small organic molecule
Emp. Form.:
C18H13FN4O2
Mol. Mass.:
336.3198
SMILES:
Fc1ccc(cc1)-c1nn(cc1C1NC(=O)NC1=O)-c1ccccc1
: