Target
Phospholipase A2
Ligand
BDBM50085496
Substrate
Meas. Tech.
ChEMBL_155887 (CHEMBL769604)
IC50
9500±n/a nM
Citation
 Lucas, RUbeda, APayá, MAlves, Mdel Olmo, ELópez, JLSan Feliciano, A Synthesis and enzyme inhibitory activities of a series of lipidic diamine and aminoalcohol derivatives on cytosolic and secretory phospholipases A2. Bioorg Med Chem Lett 10:285-8 (2000)  
Target
Name:
Phospholipase A2
Synonyms:
Group IB phospholipase A2 PLA2 PLA2G1B Phosphatidylcholine 2-acylhydrolase 1B Phospholipase A2 group 1B | phospholipase A2 precursor
Type:
Protein
Mol. Mass.:
16364.13
Organism:
Homo sapiens (Human)
Description:
P04054
Residue:
148
  
Inhibitor
Name:
BDBM50085496
Synonyms:
CHEMBL89162 N1,N1-diethylhexadecane-1,2-diamine
Type:
Small organic molecule
Emp. Form.:
C20H44N2
Mol. Mass.:
312.5768
SMILES:
CCCCCCCCCCCCCCC(N)CN(CC)CC
: