Target
Phospholipase A2, membrane associated
Ligand
BDBM50085497
Substrate
Meas. Tech.
ChEBML_156195
IC50
3700±n/a nM
Citation
 Lucas, RUbeda, APayá, MAlves, Mdel Olmo, ELópez, JLSan Feliciano, A Synthesis and enzyme inhibitory activities of a series of lipidic diamine and aminoalcohol derivatives on cytosolic and secretory phospholipases A2. Bioorg Med Chem Lett 10:285-8 (2000)  
Target
Name:
Phospholipase A2, membrane associated
Synonyms:
GIIC sPLA2 NPS-PLA2 Non-pancreatic secretory phospholipase A2 (hnps-PLA2) PLA2B PLA2L Phospholipase A2 group IIA | RASF-A
Type:
Hydrolase
Mol. Mass.:
16101.20
Organism:
Homo sapiens (Human)
Description:
The human nps PLA2 was cloned, and expressed in E. coli. There was a refolding process in the purification.
Residue:
144
  
Inhibitor
Name:
BDBM50085497
Synonyms:
2-(ethylamino)hexadecan-1-ol CHEMBL89206
Type:
Small organic molecule
Emp. Form.:
C18H39NO
Mol. Mass.:
285.5084
SMILES:
CCCCCCCCCCCCCCC(CO)NCC
: