Target
Bromodomain-containing protein 4
Ligand
BDBM50530506
Substrate
Meas. Tech.
ChEMBL_1912898 (CHEMBL4415481)
IC50
5.7±n/a nM
Citation
 Hu, JTian, CQDamaneh, MSLi, YCao, DLv, KYu, TMeng, TChen, DWang, XChen, LLi, JSong, SSHuan, XJQin, LShen, JWang, YQMiao, ZHXiong, B Structure-Based Discovery and Development of a Series of Potent and Selective Bromodomain and Extra-Terminal Protein Inhibitors. J Med Chem 62:8642-8663 (2019)  
Target
Name:
Bromodomain-containing protein 4
Synonyms:
BRD4 Bromodomain-containing protein 4 (BRD4) Protein HUNK1
Type:
Protein
Mol. Mass.:
152264.84
Organism:
Homo sapiens (Human)
Description:
O60885
Residue:
1362
  
Inhibitor
Name:
BDBM50530506
Synonyms:
CHEMBL4578490
Type:
Small organic molecule
Emp. Form.:
C23H25N5O
Mol. Mass.:
387.4775
SMILES:
CC1N(C2CC2)c2cc(ccc2N(C)C1=O)-c1nnc(C)n1-c1ccc(C)cc1
: