Target
Bromodomain-containing protein 4
Ligand
BDBM50530501
Substrate
Meas. Tech.
ChEMBL_1912898 (CHEMBL4415481)
IC50
5.4±n/a nM
Citation
 Hu, JTian, CQDamaneh, MSLi, YCao, DLv, KYu, TMeng, TChen, DWang, XChen, LLi, JSong, SSHuan, XJQin, LShen, JWang, YQMiao, ZHXiong, B Structure-Based Discovery and Development of a Series of Potent and Selective Bromodomain and Extra-Terminal Protein Inhibitors. J Med Chem 62:8642-8663 (2019)  
Target
Name:
Bromodomain-containing protein 4
Synonyms:
BRD4 Bromodomain-containing protein 4 (BRD4) Protein HUNK1
Type:
Protein
Mol. Mass.:
152264.84
Organism:
Homo sapiens (Human)
Description:
O60885
Residue:
1362
  
Inhibitor
Name:
BDBM50530501
Synonyms:
CHEMBL4573400 | US11078188, Example 6
Type:
Small organic molecule
Emp. Form.:
C30H37N7O2
Mol. Mass.:
527.6605
SMILES:
C[C@H]1N(C2CCCC2)c2cc(ccc2N(C)C1=O)-c1nc(nn1-c1ccc(C)cc1)C(=O)N1CCN(C)CC1
: