Target
Delta-type opioid receptor
Ligand
BDBM50086360
Substrate
Meas. Tech.
ChEBML_145496
Ki
881±n/a nM
Citation
 Allen, MPBlake, JFBryce, DKHaggan, MELiras, SMcLean, SSegelstein, BE Design, synthesis and biological evaluation of 3-amino-3-phenylpropionamide derivatives as novel mu opioid receptor ligands. Bioorg Med Chem Lett 10:523-6 (2000)  
Target
Name:
Delta-type opioid receptor
Synonyms:
D-OR-1 Delta opioid receptor OPIATE Delta OPRD1 OPRK1 | opioid receptor, delta 1
Type:
G Protein-Coupled Receptor (GPCR)
Mol. Mass.:
40382.98
Organism:
Homo sapiens (Human)
Description:
Competition binding assays were carried out using membrane preparations from transfected HN9.10 cells that constitutively expressed the delta opioid receptor.
Residue:
372
  
Inhibitor
Name:
BDBM50086360
Synonyms:
CHEMBL347531 | N-Cyclohexylmethyl-3-(3-hydroxy-phenyl)-2,2-dimethyl-3-methylamino-propionamide
Type:
Small organic molecule
Emp. Form.:
C19H30N2O2
Mol. Mass.:
318.4537
SMILES:
CNC(c1cccc(O)c1)C(C)(C)C(=O)NCC1CCCCC1
: