Target
Kappa-type opioid receptor
Ligand
BDBM50086357
Substrate
Meas. Tech.
ChEBML_145264
Ki
49±n/a nM
Citation
 Allen, MPBlake, JFBryce, DKHaggan, MELiras, SMcLean, SSegelstein, BE Design, synthesis and biological evaluation of 3-amino-3-phenylpropionamide derivatives as novel mu opioid receptor ligands. Bioorg Med Chem Lett 10:523-6 (2000)  
Target
Name:
Kappa-type opioid receptor
Synonyms:
K-OR-1 Kappa-opioid receptor (KOR) Kappa-type opioid receptor (KOR) OPIATE Kappa OPRK1 kappa opioid receptor (KOR)
Type:
G Protein-Coupled Receptor (GPCR)
Mol. Mass.:
42648.76
Organism:
Homo sapiens (Human)
Description:
P41145
Residue:
380
  
Inhibitor
Name:
BDBM50086357
Synonyms:
2,2-Dimethyl-3-methylamino-N-phenethyl-3-phenyl-propionamide | CHEMBL146918
Type:
Small organic molecule
Emp. Form.:
C20H26N2O
Mol. Mass.:
310.4332
SMILES:
CNC(c1ccccc1)C(C)(C)C(=O)NCCc1ccccc1
: