Target
Kappa-type opioid receptor
Ligand
BDBM50086362
Substrate
Meas. Tech.
ChEBML_145264
Ki
467±n/a nM
Citation
 Allen, MPBlake, JFBryce, DKHaggan, MELiras, SMcLean, SSegelstein, BE Design, synthesis and biological evaluation of 3-amino-3-phenylpropionamide derivatives as novel mu opioid receptor ligands. Bioorg Med Chem Lett 10:523-6 (2000)  
Target
Name:
Kappa-type opioid receptor
Synonyms:
K-OR-1 Kappa-opioid receptor (KOR) Kappa-type opioid receptor (KOR) OPIATE Kappa OPRK1 kappa opioid receptor (KOR)
Type:
G Protein-Coupled Receptor (GPCR)
Mol. Mass.:
42648.76
Organism:
Homo sapiens (Human)
Description:
P41145
Residue:
380
  
Inhibitor
Name:
BDBM50086362
Synonyms:
CHEMBL149143 | N-Benzyl-2,2-dimethyl-3-methylamino-3-phenyl-propionamide
Type:
Small organic molecule
Emp. Form.:
C19H24N2O
Mol. Mass.:
296.4067
SMILES:
CNC(c1ccccc1)C(C)(C)C(=O)NCc1ccccc1
: