Target
Mu-type opioid receptor
Ligand
BDBM50086366
Substrate
Meas. Tech.
ChEBML_149006
Ki
12±n/a nM
Citation
 Allen, MPBlake, JFBryce, DKHaggan, MELiras, SMcLean, SSegelstein, BE Design, synthesis and biological evaluation of 3-amino-3-phenylpropionamide derivatives as novel mu opioid receptor ligands. Bioorg Med Chem Lett 10:523-6 (2000)  
Target
Name:
Mu-type opioid receptor
Synonyms:
MOR-1 Mu-type opioid receptor (MOR) OPRM_RAT Opioid receptor B Ror-b
Type:
G Protein-Coupled Receptor (GPCR)
Mol. Mass.:
44503.11
Organism:
Rattus norvegicus (rat)
Description:
Competition binding assays were carried out using membrane preparations from transfected HN9.10 cells that constitutively expressed the mu opioid receptor.
Residue:
398
  
Inhibitor
Name:
BDBM50086366
Synonyms:
3-(3-Hydroxy-phenyl)-2,2-dimethyl-3-methylamino-N-(3-phenyl-propyl)-propionamide | CHEMBL347750
Type:
Small organic molecule
Emp. Form.:
C21H28N2O2
Mol. Mass.:
340.4592
SMILES:
CNC(c1cccc(O)c1)C(C)(C)C(=O)NCCCc1ccccc1
: