Target
Mu-type opioid receptor
Ligand
BDBM50086357
Substrate
Meas. Tech.
ChEBML_149006
Ki
13±n/a nM
Citation
 Allen, MPBlake, JFBryce, DKHaggan, MELiras, SMcLean, SSegelstein, BE Design, synthesis and biological evaluation of 3-amino-3-phenylpropionamide derivatives as novel mu opioid receptor ligands. Bioorg Med Chem Lett 10:523-6 (2000)  
Target
Name:
Mu-type opioid receptor
Synonyms:
MOR-1 Mu-type opioid receptor (MOR) OPRM_RAT Opioid receptor B Ror-b
Type:
G Protein-Coupled Receptor (GPCR)
Mol. Mass.:
44503.11
Organism:
Rattus norvegicus (rat)
Description:
Competition binding assays were carried out using membrane preparations from transfected HN9.10 cells that constitutively expressed the mu opioid receptor.
Residue:
398
  
Inhibitor
Name:
BDBM50086357
Synonyms:
2,2-Dimethyl-3-methylamino-N-phenethyl-3-phenyl-propionamide | CHEMBL146918
Type:
Small organic molecule
Emp. Form.:
C20H26N2O
Mol. Mass.:
310.4332
SMILES:
CNC(c1ccccc1)C(C)(C)C(=O)NCCc1ccccc1
: