Target
Thymidylate synthase
Ligand
BDBM50049170
Substrate
Meas. Tech.
ChEMBL_209994 (CHEMBL811641)
Ki
200000±n/a nM
Citation
 Bavetsias, VMarriott, JHMelin, CKimbell, RMatusiak, ZSBoyle, FTJackman, AL Design and synthesis of Cyclopenta[g]quinazoline-based antifolates as inhibitors of thymidylate synthase and potential antitumor agents(,). J Med Chem 43:1910-26 (2000)  
Target
Name:
Thymidylate synthase
Synonyms:
TSase Thymidylate Synthase (TS) thyA
Type:
Enzyme
Mol. Mass.:
36576.54
Organism:
Lactobacillus casei
Description:
Residue:
316
  
Inhibitor
Name:
BDBM50049170
Synonyms:
(R)-2-((S)-4-Carboxy-4-{4-[(2,7-dimethyl-4-oxo-3,4-dihydro-quinazolin-6-ylmethyl)-prop-2-ynyl-amino]-benzoylamino}-butyrylamino)-pentanedioic acid; TFA CHEMBL353066
Type:
Small organic molecule
Emp. Form.:
C31H33N5O9
Mol. Mass.:
619.6218
SMILES:
Cc1nc2cc(C)c(CN(CC#C)c3ccc(cc3)C(=O)N[C@@H](CCC(=O)N[C@H](CCC(O)=O)C(O)=O)C(O)=O)cc2c(=O)[nH]1
: