Target
Matrix metalloproteinase-14
Ligand
BDBM50033808
Substrate
Meas. Tech.
ChEMBL_1922609 (CHEMBL4425565)
IC50
86000±n/a nM
Citation
 Wiley, MRDurham, TBAdams, LAChambers, MGLin, CLiu, CMarimuthu, JMitchell, PGMudra, DRSwearingen, CAToth, JLWeller, JMThirunavukkarasu, K Use of Osmotic Pumps to Establish the Pharmacokinetic-Pharmacodynamic Relationship and Define Desirable Human Performance Characteristics for Aggrecanase Inhibitors. J Med Chem 59:5810-22 (2016)  
Target
Name:
Matrix metalloproteinase-14
Synonyms:
MMP-14 MMP14 MT-MMP 1 MT1MMP Matrix Metalloproteinase-14 (MMP-14) Matrix metalloproteinase-14 Membrane-type matrix metalloproteinase 1 | Membrane-type-1 matrix metalloproteinase
Type:
Protein
Mol. Mass.:
65900.19
Organism:
Homo sapiens (Human)
Description:
P50281
Residue:
582
  
Inhibitor
Name:
BDBM50033808
Synonyms:
CHEMBL3358158
Type:
Small organic molecule
Emp. Form.:
C18H14F3N5O4
Mol. Mass.:
421.3301
SMILES:
Cn1ccnc1[C@]1(CNC(=O)c2cc3cc(ccc3o2)C(F)(F)F)NC(=O)NC1=O
: