Target
Disintegrin and metalloproteinase domain-containing protein 17
Ligand
BDBM50033808
Substrate
Meas. Tech.
ChEMBL_1922610 (CHEMBL4425566)
IC50
10000±n/a nM
Citation
 Wiley, MRDurham, TBAdams, LAChambers, MGLin, CLiu, CMarimuthu, JMitchell, PGMudra, DRSwearingen, CAToth, JLWeller, JMThirunavukkarasu, K Use of Osmotic Pumps to Establish the Pharmacokinetic-Pharmacodynamic Relationship and Define Desirable Human Performance Characteristics for Aggrecanase Inhibitors. J Med Chem 59:5810-22 (2016)  
Target
Name:
Disintegrin and metalloproteinase domain-containing protein 17
Synonyms:
ADA17_HUMAN CSVP Disintegrin and metalloproteinase domain-containing protein 17 (ADAM17) TNF-alpha convertase TNF-alpha-converting enzyme (TACE) Tumor necrosis factor-α converting enzyme (TACE)
Type:
Enzyme
Mol. Mass.:
93007.89
Organism:
Homo sapiens (Human)
Description:
Residue:
824
  
Inhibitor
Name:
BDBM50033808
Synonyms:
CHEMBL3358158
Type:
Small organic molecule
Emp. Form.:
C18H14F3N5O4
Mol. Mass.:
421.3301
SMILES:
Cn1ccnc1[C@]1(CNC(=O)c2cc3cc(ccc3o2)C(F)(F)F)NC(=O)NC1=O
: