Target
P2X purinoceptor 7
Ligand
BDBM50533061
Substrate
Meas. Tech.
ChEMBL_1924282 (CHEMBL4427238)
IC50
<10.0±n/a nM
Citation
 Rech, JCBhattacharya, ALetavic, MASavall, BM The evolution of P2X7 antagonists with a focus on CNS indications. Bioorg Med Chem Lett 26:3838-45 (2016)  
Target
Name:
P2X purinoceptor 7
Synonyms:
ATP receptor P2RX7_HUMAN P2X purinoceptor 7 (P2X7) P2Z receptor | Purinergic receptor
Type:
Protein
Mol. Mass.:
68602.85
Organism:
Homo sapiens (Human)
Description:
Q99572
Residue:
595
  
Inhibitor
Name:
BDBM50533061
Synonyms:
CHEMBL4469592
Type:
Small organic molecule
Emp. Form.:
C21H27ClN2O3
Mol. Mass.:
390.904
SMILES:
C[C@H]1CC[C@@](O)(CNC(=O)c2cc(C3CCOC3)n3cccc(Cl)c23)CC1
: